Reaction Details
TargetAlpha-2C adrenergic receptor
LigandBDBM50167578
Substrate/Competitorn/a
Meas. Tech.ChEMBL_303771 (CHEMBL829301)
Ki 1.1±n/a nM
Citation Mustafa, SMBavadekar, SAMa, GMoore, BMFeller, DRMiller, DD Synthesis and biological studies of yohimbine derivatives on human alpha2C-adrenergic receptors. Bioorg Med Chem Lett15:2758-60 (2005) 
 
Alpha-2C adrenergic receptor
Name:Alpha-2C adrenergic receptor
Type:Enzyme
Mol. Mass.:49552.32
Organism:Homo sapiens (Human)
Description:P18825
Residue:462
BDBM50167578
NameBDBM50167578
Synonyms:CHEMBL369938 | {3-[((1R,2S,4aR,13bS)-2-Hydroxy-1,2,3,4,4a,5,7,8,13,13b,14,14a-dodecahydro-indolo[2',3':3,4]pyrido[1,2-b]isoquinoline-1-carbonyl)-amino]-propyl}-carbamic acid benzyl ester
TypeSmall organic molecule
Emp. Form.C31H38N4O4
Mol. Mass.530.6578
SMILESO[C@H]1CC[C@H]2CN3CCc4c([nH]c5ccccc45)[C@@H]3CC2[C@H]1C(=O)NCCCNC(=O)OCc1ccccc1