Reaction Details
TargetBifunctional purine biosynthesis protein ATIC
LigandBDBM50167703
Substrate/Competitorn/a
Meas. Tech.ChEMBL_302287 (CHEMBL830304)
Ki 3100±n/a nM
Citation Capps, KJHumiston, JDominique, RHwang, IBoger, DL Discovery of AICAR Tfase inhibitors that disrupt requisite enzyme dimerization. Bioorg Med Chem Lett15:2840-4 (2005) 
 
Bifunctional purine biosynthesis protein ATIC
Name:Bifunctional purine biosynthesis protein ATIC
Type:Protein
Mol. Mass.:64616.62
Organism:Homo sapiens (Human)
Description:P31939
Residue:592
BDBM50167703
NameBDBM50167703
Synonyms:3-Iodo-N-{[[(4-methoxy-benzylcarbamoyl)-methyl]-(phenethylcarbamoyl-methyl)-carbamoyl]-methyl}-benzamide | CHEMBL193445
TypeSmall organic molecule
Emp. Form.C29H31IN4O5
Mol. Mass.642.4847
SMILESCOc1ccc(CNC(=O)CN(CC(=O)NCCc2ccccc2)C(=O)CNC(=O)c2cccc(I)c2)cc1