Reaction Details
TargetEstrogen receptor beta
LigandBDBM50167731
Substrate/Competitorn/a
Meas. Tech.ChEMBL_305778 (CHEMBL827967)
IC50 215±n/a nM
Citation Ji, QGao, JWang, JYang, CHui, XYan, XWu, XXie, YWang, MW Benzothieno[3,2-b]indole derivatives as potent selective estrogen receptor modulators. Bioorg Med Chem Lett15:2891-3 (2005) 
 
Estrogen receptor beta
Name:Estrogen receptor beta
Type:Protein
Mol. Mass.:59238.43
Organism:Homo sapiens (Human)
Description:Q92731
Residue:530
BDBM50167731
NameBDBM50167731
Synonyms:10-[4-(2-Morpholin-4-yl-ethoxy)-benzyl]-10H-benzo[4,5]thieno[3,2-b]indol-7-ol | CHEMBL196836
TypeSmall organic molecule
Emp. Form.C27H26N2O3S
Mol. Mass.458.572
SMILESOc1ccc2c(c1)sc1c3ccccc3n(Cc3ccc(OCCN4CCOCC4)cc3)c21