Reaction Details
TargetEstrogen receptor beta
LigandBDBM50167732
Substrate/Competitorn/a
Meas. Tech.ChEMBL_305778 (CHEMBL827967)
IC50 16.6±n/a nM
Citation Ji, QGao, JWang, JYang, CHui, XYan, XWu, XXie, YWang, MW Benzothieno[3,2-b]indole derivatives as potent selective estrogen receptor modulators. Bioorg Med Chem Lett15:2891-3 (2005) 
 
Estrogen receptor beta
Name:Estrogen receptor beta
Type:Protein
Mol. Mass.:59238.43
Organism:Homo sapiens (Human)
Description:Q92731
Residue:530
BDBM50167732
NameBDBM50167732
Synonyms:10-[4-(2-Azepan-1-yl-ethoxy)-benzyl]-10H-benzo[4,5]thieno[3,2-b]indol-7-ol | CHEMBL195371
TypeSmall organic molecule
Emp. Form.C29H30N2O2S
Mol. Mass.470.626
SMILESOc1ccc2c(c1)sc1c3ccccc3n(Cc3ccc(OCCN4CCCCCC4)cc3)c21