Reaction Details
TargetEstrogen receptor
LigandBDBM50167736
Substrate/Competitorn/a
Meas. Tech.ChEMBL_305813 (CHEMBL829466)
IC50 3.34±n/a nM
Citation Ji, QGao, JWang, JYang, CHui, XYan, XWu, XXie, YWang, MW Benzothieno[3,2-b]indole derivatives as potent selective estrogen receptor modulators. Bioorg Med Chem Lett15:2891-3 (2005) 
 
Estrogen receptor
Name:Estrogen receptor
Type:Protein
Mol. Mass.:66230.44
Organism:Homo sapiens (Human)
Description:P03372
Residue:595
BDBM50167736
NameBDBM50167736
Synonyms:10-[4-(2-Azepan-1-yl-ethoxy)-benzyl]-10H-benzo[4,5]thieno[3,2-b]indole-3,7-diol | CHEMBL264216
TypeSmall organic molecule
Emp. Form.C29H30N2O3S
Mol. Mass.486.625
SMILESOc1ccc2c(c1)sc1c3cc(O)ccc3n(Cc3ccc(OCCN4CCCCCC4)cc3)c21