Reaction Details
TargetEstrogen receptor beta
LigandBDBM50168352
Substrate/Competitorn/a
Meas. Tech.ChEMBL_306229 (CHEMBL831137)
IC50 1.2±n/a nM
Citation Mewshaw, REEdsall, RJYang, CManas, ESXu, ZBHenderson, RAKeith, JCHarris, HA ERbeta ligands. 3. Exploiting two binding orientations of the 2-phenylnaphthalene scaffold to achieve ERbeta selectivity. J Med Chem48:3953-79 (2005) 
 
Estrogen receptor beta
Name:Estrogen receptor beta
Type:Protein
Mol. Mass.:59238.43
Organism:Homo sapiens (Human)
Description:Q92731
Residue:530
BDBM50168352
NameBDBM50168352
Synonyms:4-Ethynyl-6-(3-fluoro-4-hydroxy-phenyl)-naphthalen-2-ol | CHEMBL191759
TypeSmall organic molecule
Emp. Form.C18H11FO2
Mol. Mass.278.2771
SMILESOc1cc(C#C)c2cc(ccc2c1)-c1ccc(O)c(F)c1