Reaction Details
TargetEstrogen receptor beta
LigandBDBM50168365
Substrate/Competitorn/a
Meas. Tech.ChEMBL_306229 (CHEMBL831137)
IC50 2.2±n/a nM
Citation Mewshaw, REEdsall, RJYang, CManas, ESXu, ZBHenderson, RAKeith, JCHarris, HA ERbeta ligands. 3. Exploiting two binding orientations of the 2-phenylnaphthalene scaffold to achieve ERbeta selectivity. J Med Chem48:3953-79 (2005) 
 
Estrogen receptor beta
Name:Estrogen receptor beta
Type:Protein
Mol. Mass.:59238.43
Organism:Homo sapiens (Human)
Description:Q92731
Residue:530
BDBM50168365
NameBDBM50168365
Synonyms:3-(2,6-Difluoro-4-hydroxy-phenyl)-7-hydroxy-naphthalene-1-carbonitrile | CHEMBL426641
TypeSmall organic molecule
Emp. Form.C17H9F2NO2
Mol. Mass.297.2557
SMILESOc1ccc2cc(cc(C#N)c2c1)-c1c(F)cc(O)cc1F