Reaction Details
TargetEstrogen receptor beta
LigandBDBM50168367
Substrate/Competitorn/a
Meas. Tech.ChEMBL_306229 (CHEMBL831137)
IC50 1.1±n/a nM
Citation Mewshaw, REEdsall, RJYang, CManas, ESXu, ZBHenderson, RAKeith, JCHarris, HA ERbeta ligands. 3. Exploiting two binding orientations of the 2-phenylnaphthalene scaffold to achieve ERbeta selectivity. J Med Chem48:3953-79 (2005) 
 
Estrogen receptor beta
Name:Estrogen receptor beta
Type:Protein
Mol. Mass.:59238.43
Organism:Homo sapiens (Human)
Description:Q92731
Residue:530
BDBM50168367
NameBDBM50168367
Synonyms:1-Chloro-8-fluoro-6-(4-hydroxy-phenyl)-naphthalen-2-ol | CHEMBL193146
TypeSmall organic molecule
Emp. Form.C16H10ClFO2
Mol. Mass.288.701
SMILESOc1ccc(cc1)-c1cc(F)c2c(Cl)c(O)ccc2c1