Reaction Details
TargetEstrogen receptor beta
LigandBDBM50168353
Substrate/Competitorn/a
Meas. Tech.ChEMBL_306229 (CHEMBL831137)
IC50 1.6±n/a nM
Citation Mewshaw, REEdsall, RJYang, CManas, ESXu, ZBHenderson, RAKeith, JCHarris, HA ERbeta ligands. 3. Exploiting two binding orientations of the 2-phenylnaphthalene scaffold to achieve ERbeta selectivity. J Med Chem48:3953-79 (2005) 
 
Estrogen receptor beta
Name:Estrogen receptor beta
Type:Protein
Mol. Mass.:59238.43
Organism:Homo sapiens (Human)
Description:Q92731
Residue:530
BDBM50168353
NameBDBM50168353
Synonyms:8-Fluoro-6-(4-hydroxy-phenyl)-naphthalen-2-ol | CHEMBL192386
TypeSmall organic molecule
Emp. Form.C16H11FO2
Mol. Mass.254.2557
SMILESOc1ccc(cc1)-c1cc(F)c2cc(O)ccc2c1