Reaction Details
TargetDisintegrin and metalloproteinase domain-containing protein 17
LigandBDBM50168742
Substrate/Competitorn/a
Meas. Tech.ChEMBL_305111 (CHEMBL831580)
IC50 0.48±n/a nM
Citation Noe, MCNatarajan, VSnow, SLWolf-Gouveia, LAMitchell, PGLopresti-Morrow, LReeves, LMYocum, SAOtterness, IBliven, MACarty, TJBarberia, JTSweeney, FJLiras, JLVaughn, M Discovery of 3-OH-3-methylpipecolic hydroxamates: potent orally active inhibitors of aggrecanase and MMP-13. Bioorg Med Chem Lett15:3385-8 (2005) 
 
Disintegrin and metalloproteinase domain-containing protein 17
Name:Disintegrin and metalloproteinase domain-containing protein 17
Type:Enzyme
Mol. Mass.:93007.89
Organism:Homo sapiens (Human)
Description:
Residue:824
BDBM50168742
NameBDBM50168742
Synonyms:(2R,3R)-3-Hydroxy-3-methyl-1-[4-(quinolin-8-ylmethoxy)-benzenesulfonyl]-piperidine-2-carboxylic acid hydroxyamide | CHEMBL446697
TypeSmall organic molecule
Emp. Form.C23H25N3O6S
Mol. Mass.471.526
SMILESC[C@@]1(O)CCCN([C@H]1C(=O)NO)S(=O)(=O)c1ccc(OCc2cccc3cccnc23)cc1