Reaction Details
TargetInterstitial collagenase
LigandBDBM50168737
Substrate/Competitorn/a
Meas. Tech.ChEMBL_304617 (CHEMBL828503)
IC50 310±n/a nM
Citation Noe, MCNatarajan, VSnow, SLWolf-Gouveia, LAMitchell, PGLopresti-Morrow, LReeves, LMYocum, SAOtterness, IBliven, MACarty, TJBarberia, JTSweeney, FJLiras, JLVaughn, M Discovery of 3-OH-3-methylpipecolic hydroxamates: potent orally active inhibitors of aggrecanase and MMP-13. Bioorg Med Chem Lett15:3385-8 (2005) 
 
Interstitial collagenase
Name:Interstitial collagenase
Type:Enzyme
Mol. Mass.:54010.26
Organism:Homo sapiens (Human)
Description: P03956
Residue:469
BDBM50168737
NameBDBM50168737
Synonyms:(2R,3R)-1-[4-(2-Chloro-4-fluoro-benzyloxy)-benzenesulfonyl]-3-hydroxy-3-methyl-piperidine-2-carboxylic acid hydroxyamide | CHEMBL187092
TypeSmall organic molecule
Emp. Form.C20H22ClFN2O6S
Mol. Mass.472.915
SMILESC[C@@]1(O)CCCN([C@H]1C(=O)NO)S(=O)(=O)c1ccc(OCc2ccc(F)cc2Cl)cc1