Reaction Details
TargetMu-type opioid receptor
LigandBDBM50594825
Substrate/Competitorn/a
Meas. Tech.ChEMBL_2214381 (CHEMBL5127513)
Ki 0.051100±n/a nM
Citation Smith, MTKong, DKuo, AImam, MZWilliams, CM Analgesic Opioid Ligand Discovery Based on Nonmorphinan Scaffolds Derived from Natural Sources. J Med Chem65:1612-1661 (2022) 
 
Mu-type opioid receptor
Name:Mu-type opioid receptor
Type:G Protein-Coupled Receptor (GPCR)
Mol. Mass.:44789.51
Organism:Homo sapiens (Human)
Description:P35372
Residue:400
BDBM50594825
NameBDBM50594825
Synonyms:CHEMBL5198856
TypeSmall organic molecule
Emp. Form.C34H41N5O5
Mol. Mass.599.7198
SMILESC[C@@H](N(C)C(=O)[C@@H](N)Cc1c(C)cc(O)cc1C)C(=O)N[C@@H](Cc1ccccc1)C(=O)N[C@H](C(=C)C(N)=O)c1ccccc1