Reaction Details
TargetLysine-specific histone demethylase 1A
LigandBDBM50594947
Substrate/Competitorn/a
Meas. Tech.ChEMBL_2214771 (CHEMBL5127903)
IC50 0.140000±n/a nM
Citation He, XZhang, HZhang, YYe, YWang, SBai, RXie, TYe, XY Drug discovery of histone lysine demethylases (KDMs) inhibitors (progress from 2018 to present). Eur J Med Chem231:0 (2022) 
 
Lysine-specific histone demethylase 1A
Name:Lysine-specific histone demethylase 1A
Type:Enzyme
Mol. Mass.:92901.01
Organism:Homo sapiens (Human)
Description:O60341
Residue:852
BDBM50594947
NameBDBM50594947
Synonyms:ORY-2001 Vafidemstat
TypeSmall organic molecule
Emp. Form.C19H20N4O2
Mol. Mass.336.3877
SMILESNc1nnc(CN[C@@H]2C[C@H]2c2ccc(OCc3ccccc3)cc2)o1