Reaction Details
Target5-hydroxytryptamine receptor 2B
LigandBDBM50169261
Substrate/Competitorn/a
Meas. Tech.ChEMBL_303086 (CHEMBL828758)
Ki 19±n/a nM
Citation Röver, SAdams, DRBénardeau, ABentley, JMBickerdike, MJBourson, ACliffe, IACoassolo, PDavidson, JEDourish, CTHebeisen, PKennett, GAKnight, ARMalcolm, CSMattei, PMisra, AMizrahi, JMuller, MPorter, RHRichter, HTaylor, SVickers, SP Identification of 4-methyl-1,2,3,4,10,10a-hexahydropyrazino[1,2-a]indoles as 5-HT2C receptor agonists. Bioorg Med Chem Lett15:3604-8 (2005) 
 
5-hydroxytryptamine receptor 2B
Name:5-hydroxytryptamine receptor 2B
Type:G Protein-Coupled Receptor (GPCR)
Mol. Mass.:54312.47
Organism:Homo sapiens (Human)
Description:Receptor binding assays were performed using human clone stably expressed in CHO cells.
Residue:481
BDBM50169261
NameBDBM50169261
Synonyms:(4R,10aS)-7-Chloro-4,6-dimethyl-1,2,3,4,10,10a-hexahydro-pyrazino[1,2-a]indole CHEMBL191054
TypeSmall organic molecule
Emp. Form.C13H17ClN2
Mol. Mass.236.74
SMILESC[C@@H]1CNC[C@@H]2Cc3ccc(Cl)c(C)c3N12