Reaction Details
Target5-hydroxytryptamine receptor 2B
LigandBDBM50169266
Substrate/Competitorn/a
Meas. Tech.ChEMBL_303086 (CHEMBL828758)
Ki 11±n/a nM
Citation Röver, SAdams, DRBénardeau, ABentley, JMBickerdike, MJBourson, ACliffe, IACoassolo, PDavidson, JEDourish, CTHebeisen, PKennett, GAKnight, ARMalcolm, CSMattei, PMisra, AMizrahi, JMuller, MPorter, RHRichter, HTaylor, SVickers, SP Identification of 4-methyl-1,2,3,4,10,10a-hexahydropyrazino[1,2-a]indoles as 5-HT2C receptor agonists. Bioorg Med Chem Lett15:3604-8 (2005) 
 
5-hydroxytryptamine receptor 2B
Name:5-hydroxytryptamine receptor 2B
Type:G Protein-Coupled Receptor (GPCR)
Mol. Mass.:54312.47
Organism:Homo sapiens (Human)
Description:Receptor binding assays were performed using human clone stably expressed in CHO cells.
Residue:481
BDBM50169266
NameBDBM50169266
Synonyms:(4R,10aR)-4-Methyl-7-trifluoromethyl-1,2,3,4,10,10a-hexahydro-pyrazino[1,2-a]indole | CHEMBL361079
TypeSmall organic molecule
Emp. Form.C13H15F3N2
Mol. Mass.256.2668
SMILESC[C@@H]1CNC[C@H]2Cc3ccc(cc3N12)C(F)(F)F