Reaction Details
Target5-hydroxytryptamine receptor 2C
LigandBDBM50169271
Substrate/Competitorn/a
Meas. Tech.ChEMBL_303087 (CHEMBL828759)
Ki 680±n/a nM
Citation Röver, SAdams, DRBénardeau, ABentley, JMBickerdike, MJBourson, ACliffe, IACoassolo, PDavidson, JEDourish, CTHebeisen, PKennett, GAKnight, ARMalcolm, CSMattei, PMisra, AMizrahi, JMuller, MPorter, RHRichter, HTaylor, SVickers, SP Identification of 4-methyl-1,2,3,4,10,10a-hexahydropyrazino[1,2-a]indoles as 5-HT2C receptor agonists. Bioorg Med Chem Lett15:3604-8 (2005) 
 
5-hydroxytryptamine receptor 2C
Name:5-hydroxytryptamine receptor 2C
Type:G Protein-Coupled Receptor (GPCR)
Mol. Mass.:51836.79
Organism:Homo sapiens (Human)
Description:P28335
Residue:458
BDBM50169271
NameBDBM50169271
Synonyms:CHEMBL187787 | N-((4R,10aR)-4-Methyl-1,2,3,4,10,10a-hexahydro-pyrazino[1,2-a]indol-7-yl)-acetamide
TypeSmall organic molecule
Emp. Form.C14H19N3O
Mol. Mass.245.3202
SMILESC[C@@H]1CNC[C@H]2Cc3ccc(NC(C)=O)cc3N12