Reaction Details
Target5-hydroxytryptamine receptor 2B
LigandBDBM50169271
Substrate/Competitorn/a
Meas. Tech.ChEMBL_303086 (CHEMBL828758)
Ki 960±n/a nM
Citation Röver, SAdams, DRBénardeau, ABentley, JMBickerdike, MJBourson, ACliffe, IACoassolo, PDavidson, JEDourish, CTHebeisen, PKennett, GAKnight, ARMalcolm, CSMattei, PMisra, AMizrahi, JMuller, MPorter, RHRichter, HTaylor, SVickers, SP Identification of 4-methyl-1,2,3,4,10,10a-hexahydropyrazino[1,2-a]indoles as 5-HT2C receptor agonists. Bioorg Med Chem Lett15:3604-8 (2005) 
 
5-hydroxytryptamine receptor 2B
Name:5-hydroxytryptamine receptor 2B
Type:G Protein-Coupled Receptor (GPCR)
Mol. Mass.:54312.47
Organism:Homo sapiens (Human)
Description:Receptor binding assays were performed using human clone stably expressed in CHO cells.
Residue:481
BDBM50169271
NameBDBM50169271
Synonyms:CHEMBL187787 | N-((4R,10aR)-4-Methyl-1,2,3,4,10,10a-hexahydro-pyrazino[1,2-a]indol-7-yl)-acetamide
TypeSmall organic molecule
Emp. Form.C14H19N3O
Mol. Mass.245.3202
SMILESC[C@@H]1CNC[C@H]2Cc3ccc(NC(C)=O)cc3N12