Reaction Details
TargetMelanin-concentrating hormone receptor 1
LigandBDBM50169381
Substrate/Competitorn/a
Meas. Tech.ChEMBL_303523 (CHEMBL839637)
Ki 11±n/a nM
Citation Guo, TShao, YQian, GRokosz, LLStauffer, TMHunter, RCBabu, SDGu, HHobbs, DW Discovery and SAR of biaryl piperidine MCH1 receptor antagonists through solid-phase encoded combinatorial synthesis. Bioorg Med Chem Lett15:3696-700 (2005) 
 
Melanin-concentrating hormone receptor 1
Name:Melanin-concentrating hormone receptor 1
Type:G Protein-Coupled Receptor (GPCR)
Mol. Mass.:45976.27
Organism:Homo sapiens (Human)
Description:Membranes from CHO-K1 cells stably expressing human MCH1R were used in assays.
Residue:422
BDBM50169381
NameBDBM50169381
Synonyms:1-[4-(3'-Cyano-biphenyl-4-yl)-1-cyclobutyl-piperidin-4-ylmethyl]-3-(3,5-dichloro-phenyl)-urea | CHEMBL175964
TypeSmall organic molecule
Emp. Form.C30H30Cl2N4O
Mol. Mass.533.491
SMILESClc1cc(Cl)cc(NC(=O)NCC2(CCN(CC2)C2CCC2)c2ccc(cc2)-c2cccc(c2)C#N)c1