Reaction Details
TargetGenome polyprotein
LigandBDBM50169410
Substrate/Competitorn/a
Meas. Tech.ChEMBL_305506 (CHEMBL831108)
IC50 130±n/a nM
Citation Han, WJiang, XHu, ZWasserman, ZRDecicco, CP Investigation of glycine alpha-ketoamide HCV NS3 protease inhibitors: effect of carboxylic acid isosteres. Bioorg Med Chem Lett15:3487-90 (2005) 
 
Genome polyprotein
Name:Genome polyprotein
Type:Protein
Mol. Mass.:67067.41
Organism:Hepatitis C virus
Description:A3EZI9
Residue:631
BDBM50169410
NameBDBM50169410
Synonyms:CHEMBL187781 | Pyrazine-2-carboxylic acid {(S)-1-[1-((S)-2-cyclohexyl-1-{(S)-(S)-1-[2-(3,5-dichloro-benzenesulfonylamino)-2-oxo-ethylaminooxalyl]-propylcarbamoyl}-ethylcarbamoyl)-2-methyl-butylcarbamoyl]-3-methyl-butyl}-amide
TypeSmall organic molecule
Emp. Form.C39H54Cl2N8O9S
Mol. Mass.881.865
SMILESCC[C@H](C)[C@H](NC(=O)[C@H](CC(C)C)NC(=O)c1cnccn1)C(=O)N[C@@H](CC1CCCCC1)C(=O)N[C@@H](CC)C(=O)C(=O)NCC(=O)NS(=O)(=O)c1cc(Cl)cc(Cl)c1