Reaction Details
TargetCorticotropin-releasing factor receptor 1
LigandBDBM50169535
Substrate/Competitorn/a
Meas. Tech.ChEMBL_303113 (CHEMBL829622)
Ki 11±n/a nM
Citation Han, XPin, SSBurris, KFung, LKHuang, STaber, MTZhang, JDubowchik, GM Synthesis and structure-activity relationship of imidazo[1,2-a]benzimidazoles as corticotropin-releasing factor 1 receptor antagonists. Bioorg Med Chem Lett15:4029-32 (2005) 
 
Corticotropin-releasing factor receptor 1
Name:Corticotropin-releasing factor receptor 1
Type:Enzyme
Mol. Mass.:50744.31
Organism:Homo sapiens (Human)
Description:P34998
Residue:444
BDBM50169535
NameBDBM50169535
Synonyms:CHEMBL363592 | Dipropyl-[2-trifluoromethyl-9-(2,4,6-trimethyl-phenyl)-9H-benzo[d]imidazo[1,2-a]imidazol-3-ylmethyl]-amine
TypeSmall organic molecule
Emp. Form.C28H31F3N4
Mol. Mass.480.5677
SMILESCc1cc(C)c(c(C)c1)-n1c2ccccc2n2c(CN(CC3CC3)CC3CC3)c(nc12)C(F)(F)F