Reaction Details
TargetEstrogen receptor beta
LigandBDBM50144849
Substrate/Competitorn/a
Meas. Tech.ChEMBL_306592 (CHEMBL832939)
IC50 43±n/a nM
Citation Blizzard, TADiNinno, FChen, HYKim, SWu, JYChan, WBirzin, ETYang, YTPai, LYHayes, ECDaSilva, CARohrer, SPSchaeffer, JMHammond, ML Estrogen receptor ligands. Part 13: Dihydrobenzoxathiin SERAMs with an optimized antagonist side chain. Bioorg Med Chem Lett15:3912-6 (2005) 
 
Estrogen receptor beta
Name:Estrogen receptor beta
Type:Protein
Mol. Mass.:59238.43
Organism:Homo sapiens (Human)
Description:Q92731
Residue:530
BDBM50144849
NameBDBM50144849
Synonyms:(2S,3R)-2-(4-(2-(PIPERIDIN-1-YL)ETHOXY)PHENYL)-2,3-DIHYDRO-3-(4-HYDROXYPHENYL)BENZO[B][1,4]OXATHIIN-6-OL CHEMBL304552
TypeSmall organic molecule
Emp. Form.C27H29NO4S
Mol. Mass.463.588
SMILESOc1ccc(cc1)[C@H]1Sc2cc(O)ccc2O[C@H]1c1ccc(OCCN2CCCCC2)cc1