Reaction Details
TargetCyclin-dependent kinase 5 activator 1
LigandBDBM50169892
Substrate/Competitorn/a
Meas. Tech.ChEMBL_304607 (CHEMBL828494)
IC50 3±n/a nM
Citation Kuo, GHDeangelis, AEmanuel, SWang, AZhang, YConnolly, PJChen, XGruninger, RHRugg, CFuentes-Pesquera, AMiddleton, SAJolliffe, LMurray, WV Synthesis and identification of [1,3,5]triazine-pyridine biheteroaryl as a novel series of potent cyclin-dependent kinase inhibitors. J Med Chem48:4535-46 (2005) 
 
Cyclin-dependent kinase 5 activator 1
Name:Cyclin-dependent kinase 5 activator 1
Type:Protein Complex
Mol. Mass.:n/a
Description:n/a
Components:This complex has 2 components.
Component 1
Name:Cyclin-dependent kinase 5
Synonyms:CDK5 CDKN5 Cyclin-dependent kinase 5 (CDK5/ p25) Cyclin-dependent-like kinase 5 PSSALRE Tau protein kinase II catalytic subunit
Type:Enzyme Subunit
Mol. Mass.:33308.61
Organism:Homo sapiens (Human)
Description:n/a
Residue:292
Component 2
Name:Cyclin-dependent kinase 5 activator 1
Synonyms:CD5R1_HUMAN CDK5R1 Cyclin-dependent kinase 5 (CDK5/p25) NCK5A p35
Type:Enzyme Subunit
Mol. Mass.:34077.43
Organism:Homo sapiens (Human)
Description:Q15078
Residue:307
BDBM50169892
NameBDBM50169892
Synonyms:3-{4-[4-(3-Chloro-phenylamino)-[1,3,5]triazin-2-yl]-pyridin-2-ylamino}-propan-1-ol | CHEMBL191336
TypeSmall organic molecule
Emp. Form.C17H17ClN6O
Mol. Mass.356.809
SMILESOCCCNc1cc(ccn1)-c1ncnc(Nc2cccc(Cl)c2)n1