Reaction Details
TargetCyclin-dependent kinase 1
LigandBDBM50169895
Substrate/Competitorn/a
Meas. Tech.ChEMBL_305069 (CHEMBL832701)
IC50 60±n/a nM
Citation Kuo, GHDeangelis, AEmanuel, SWang, AZhang, YConnolly, PJChen, XGruninger, RHRugg, CFuentes-Pesquera, AMiddleton, SAJolliffe, LMurray, WV Synthesis and identification of [1,3,5]triazine-pyridine biheteroaryl as a novel series of potent cyclin-dependent kinase inhibitors. J Med Chem48:4535-46 (2005) 
 
Cyclin-dependent kinase 1
Name:Cyclin-dependent kinase 1
Type:Enzyme Subunit
Mol. Mass.:34101.08
Organism:Homo sapiens (Human)
Description:P06493
Residue:297
BDBM50169895
NameBDBM50169895
Synonyms:3-{5-[4-(3-Chloro-phenylamino)-[1,3,5]triazin-2-yl]-pyridin-3-ylamino}-propan-1-ol | CHEMBL365937
TypeSmall organic molecule
Emp. Form.C17H17ClN6O
Mol. Mass.356.809
SMILESOCCCNc1cncc(c1)-c1ncnc(Nc2cccc(Cl)c2)n1