Reaction Details
TargetReverse transcriptase/RNaseH
LigandBDBM50170148
Substrate/Competitorn/a
Meas. Tech.ChEMBL_306441 (CHEMBL829085)
IC50>100000±n/a nM
Citation Normand-Bayle, MBénard, CZouhiri, FMouscadet, JFLeh, HThomas, CMMbemba, GDesmaële, Dd'Angelo, J New HIV-1 replication inhibitors of the styryquinoline class bearing aroyl/acyl groups at the C-7 position: synthesis and biological activity. Bioorg Med Chem Lett15:4019-22 (2005) 
 
Reverse transcriptase/RNaseH
Name:Reverse transcriptase/RNaseH
Type:PROTEIN
Mol. Mass.:65229.15
Organism:Human immunodeficiency virus 1
Description:ChEMBL_1473730
Residue:566
BDBM50170148
NameBDBM50170148
Synonyms:CHEMBL188712 | {2-[(E)-2-(3,4-Dihydroxy-phenyl)-vinyl]-8-hydroxy-quinolin-7-yl}-(4-hydroxy-phenyl)-methanone
TypeSmall organic molecule
Emp. Form.C24H17NO5
Mol. Mass.399.3955
SMILESOc1ccc(cc1)C(=O)c1ccc2ccc(\C=C\c3ccc(O)c(O)c3)nc2c1O