Reaction Details
TargetReverse transcriptase/RNaseH
LigandBDBM50170149
Substrate/Competitorn/a
Meas. Tech.ChEMBL_306441 (CHEMBL829085)
IC50>100000±n/a nM
Citation Normand-Bayle, MBénard, CZouhiri, FMouscadet, JFLeh, HThomas, CMMbemba, GDesmaële, Dd'Angelo, J New HIV-1 replication inhibitors of the styryquinoline class bearing aroyl/acyl groups at the C-7 position: synthesis and biological activity. Bioorg Med Chem Lett15:4019-22 (2005) 
 
Reverse transcriptase/RNaseH
Name:Reverse transcriptase/RNaseH
Type:PROTEIN
Mol. Mass.:65229.15
Organism:Human immunodeficiency virus 1
Description:ChEMBL_1473730
Residue:566
BDBM50170149
NameBDBM50170149
Synonyms:(3,4-Difluoro-phenyl)-{2-[(E)-2-(3,4-dihydroxy-phenyl)-vinyl]-8-hydroxy-quinolin-7-yl}-methanone | CHEMBL189715
TypeSmall organic molecule
Emp. Form.C24H15F2NO4
Mol. Mass.419.377
SMILESOc1ccc(\C=C\c2ccc3ccc(C(=O)c4ccc(F)c(F)c4)c(O)c3n2)cc1O