Reaction Details
TargetNeuronal acetylcholine receptor subunit alpha-7
LigandBDBM50170270
Substrate/Competitorn/a
Meas. Tech.ChEMBL_304158 (CHEMBL829997)
EC50 21000±n/a nM
Citation Papke, RLZheng, GHorenstein, NADwoskin, LPCrooks, PA The characterization of a novel rigid nicotine analog with alpha7-selective nAChR agonist activity and modulation of agonist properties by boron inclusion. Bioorg Med Chem Lett15:3874-80 (2005) 
 
Neuronal acetylcholine receptor subunit alpha-7
Name:Neuronal acetylcholine receptor subunit alpha-7
Type:Enzyme
Mol. Mass.:56502.44
Organism:Rattus norvegicus (Rat)
Description:Q05941
Residue:502
BDBM50170270
NameBDBM50170270
Synonyms:CHEMBL182530 | S(-)nicotine-B
TypeSmall organic molecule
Emp. Form.C11H15BN3
Mol. Mass.200.067
SMILESCN1CCC[C@H]1c1ccc[n+](BC#N)c1