Reaction Details
TargetNeuronal acetylcholine receptor subunit alpha-4/beta-2
LigandBDBM50099564
Substrate/Competitorn/a
Meas. Tech.ChEMBL_303459 (CHEMBL839719)
Ki 12200±n/a nM
Citation Papke, RLZheng, GHorenstein, NADwoskin, LPCrooks, PA The characterization of a novel rigid nicotine analog with alpha7-selective nAChR agonist activity and modulation of agonist properties by boron inclusion. Bioorg Med Chem Lett15:3874-80 (2005) 
 
Neuronal acetylcholine receptor subunit alpha-4/beta-2
Name:Neuronal acetylcholine receptor subunit alpha-4/beta-2
Type:n/a
Mol. Mass.:n/a
Description:n/a
Components:This complex has 0 components.
Component 1
Name:Neuronal acetylcholine receptor subunit alpha-4
Synonyms:ACHA4_RAT Cholinergic, Nicotinic Alpha4Beta2 Chrna4 Neuronal acetylcholine receptor (alpha4beta2 nAChR) Neuronal acetylcholine receptor subunit alpha 4 beta 2 | Neuronal acetylcholine receptor subunit alpha-4
Type:Enzyme
Mol. Mass.:70196.44
Organism:Rattus norvegicus (Rat)
Description:P09483
Residue:630
Component 2
Name:Neuronal acetylcholine receptor subunit beta-2
Synonyms:ACHB2_RAT Chrnb2 Neuronal acetylcholine receptor non-alpha-1 chain
Type:Enzyme
Mol. Mass.:56910.32
Organism:Rattus norvegicus (Rat)
Description:P12390
Residue:500
BDBM50099564
NameBDBM50099564
Synonyms:(3aR,9bS)-1-Methyl-2,3,3a,4,5,9b-hexahydro-1H-pyrrolo[2,3-f]quinoline | CHEMBL281410
TypeSmall organic molecule
Emp. Form.C12H16N2
Mol. Mass.188.2688
SMILESCN1CC[C@H]2CCc3ncccc3[C@@H]12