Reaction Details
TargetNeuronal acetylcholine receptor subunit alpha-7
LigandBDBM50170271
Substrate/Competitorn/a
Meas. Tech.ChEMBL_303011 (CHEMBL830250)
Ki>100000±n/a nM
Citation Papke, RLZheng, GHorenstein, NADwoskin, LPCrooks, PA The characterization of a novel rigid nicotine analog with alpha7-selective nAChR agonist activity and modulation of agonist properties by boron inclusion. Bioorg Med Chem Lett15:3874-80 (2005) 
 
Neuronal acetylcholine receptor subunit alpha-7
Name:Neuronal acetylcholine receptor subunit alpha-7
Type:Enzyme
Mol. Mass.:56502.44
Organism:Rattus norvegicus (Rat)
Description:Q05941
Residue:502
BDBM50170271
NameBDBM50170271
Synonyms:(2S,6R)-10-(cyanoboranyl)-3-methyl-3,10-diazatricyclo[7.4.0.0^{2,6}]trideca-1(9),10,12-trien-10-ium | CHEMBL361372
TypeSmall organic molecule
Emp. Form.C13H17BN3
Mol. Mass.226.105
SMILESCN1CC[C@H]2CCc3c(ccc[n+]3BC#N)[C@@H]12