Reaction Details
TargetNeuronal acetylcholine receptor subunit alpha-7
LigandBDBM82070
Substrate/Competitorn/a
Meas. Tech.ChEMBL_304158 (CHEMBL829997)
EC50 13000±n/a nM
Citation Papke, RLZheng, GHorenstein, NADwoskin, LPCrooks, PA The characterization of a novel rigid nicotine analog with alpha7-selective nAChR agonist activity and modulation of agonist properties by boron inclusion. Bioorg Med Chem Lett15:3874-80 (2005) 
 
Neuronal acetylcholine receptor subunit alpha-7
Name:Neuronal acetylcholine receptor subunit alpha-7
Type:Enzyme
Mol. Mass.:56502.44
Organism:Rattus norvegicus (Rat)
Description:Q05941
Residue:502
BDBM82070
NameBDBM82070
Synonyms:CAS_29790-52-1 Nicotine-D salicylate US9303017, Nicotine
Typen/a
Emp. Form.C10H14N2
Mol. Mass.162.2316
SMILESCN1CCC[C@H]1c1cccnc1