Reaction Details
TargetCannabinoid receptor 1
LigandBDBM50170339
Substrate/Competitorn/a
Meas. Tech.ChEMBL_310455 (CHEMBL834400)
EC50 29±n/a nM
Citation Huffman, JWSzklennik, PVAlmond, ABushell, KSelley, DEHe, HCassidy, MPWiley, JLMartin, BR 1-Pentyl-3-phenylacetylindoles, a new class of cannabimimetic indoles. Bioorg Med Chem Lett15:4110-3 (2005) 
 
Cannabinoid receptor 1
Name:Cannabinoid receptor 1
Type:G Protein-Coupled Receptor (GPCR)
Mol. Mass.:52856.55
Organism:Rattus norvegicus (rat)
Description:P20272
Residue:473
BDBM50170339
NameBDBM50170339
Synonyms:1-(1-Pentyl-1H-indol-3-yl)-2-o-tolyl-ethanone CHEMBL364820 | JWH-251
TypeSmall organic molecule
Emp. Form.C22H25NO
Mol. Mass.319.44
SMILESCCCCCn1cc(C(=O)Cc2ccccc2C)c2ccccc12