Reaction Details
TargetMethionine aminopeptidase 1
LigandBDBM50170361
Substrate/Competitorn/a
Meas. Tech.ChEMBL_304990 (CHEMBL828603)
IC50 410±n/a nM
Citation Cui, YMHuang, QQXu, JChen, LLLi, JYYe, QZLi, JNan, FJ Identification of potent type I MetAPs inhibitors by simple bioisosteric replacement. Part 2: SAR studies of 5-heteroalkyl substituted TCAT derivatives. Bioorg Med Chem Lett15:4130-5 (2005) 
 
Methionine aminopeptidase 1
Name:Methionine aminopeptidase 1
Type:PROTEIN
Mol. Mass.:43382.92
Organism:Saccharomyces cerevisiae
Description:ChEMBL_10701
Residue:387
BDBM50170361
NameBDBM50170361
Synonyms:5-(2-Piperidin-1-yl-ethyl)-thiazole-4-carboxylic acid thiazol-2-ylamide | CHEMBL188429
TypeSmall organic molecule
Emp. Form.C14H18N4OS2
Mol. Mass.322.449
SMILESO=C(Nc1nccs1)c1ncsc1CCN1CCCCC1