Reaction Details
TargetMethionine aminopeptidase 1
LigandBDBM50170366
Substrate/Competitorn/a
Meas. Tech.ChEMBL_304990 (CHEMBL828603)
IC50 390±n/a nM
Citation Cui, YMHuang, QQXu, JChen, LLLi, JYYe, QZLi, JNan, FJ Identification of potent type I MetAPs inhibitors by simple bioisosteric replacement. Part 2: SAR studies of 5-heteroalkyl substituted TCAT derivatives. Bioorg Med Chem Lett15:4130-5 (2005) 
 
Methionine aminopeptidase 1
Name:Methionine aminopeptidase 1
Type:PROTEIN
Mol. Mass.:43382.92
Organism:Saccharomyces cerevisiae
Description:ChEMBL_10701
Residue:387
BDBM50170366
NameBDBM50170366
Synonyms:5-[2-(4-Fluoro-phenyl)-2-methoxy-ethyl]-thiazole-4-carboxylic acid thiazol-2-ylamide | CHEMBL441389
TypeSmall organic molecule
Emp. Form.C16H14FN3O2S2
Mol. Mass.363.43
SMILESCOC(Cc1scnc1C(=O)Nc1nccs1)c1ccc(F)cc1