Reaction Details
TargetMethionine aminopeptidase 1
LigandBDBM50170369
Substrate/Competitorn/a
Meas. Tech.ChEMBL_304990 (CHEMBL828603)
IC50 150±n/a nM
Citation Cui, YMHuang, QQXu, JChen, LLLi, JYYe, QZLi, JNan, FJ Identification of potent type I MetAPs inhibitors by simple bioisosteric replacement. Part 2: SAR studies of 5-heteroalkyl substituted TCAT derivatives. Bioorg Med Chem Lett15:4130-5 (2005) 
 
Methionine aminopeptidase 1
Name:Methionine aminopeptidase 1
Type:PROTEIN
Mol. Mass.:43382.92
Organism:Saccharomyces cerevisiae
Description:ChEMBL_10701
Residue:387
BDBM50170369
NameBDBM50170369
Synonyms:5-(2-Ethoxy-3-methyl-butyl)-thiazole-4-carboxylic acid thiazol-2-ylamide | CHEMBL363943
TypeSmall organic molecule
Emp. Form.C14H19N3O2S2
Mol. Mass.325.45
SMILESCCOC(Cc1scnc1C(=O)Nc1nccs1)C(C)C