Reaction Details
TargetTubulin beta chain [1-43]
LigandBDBM50170567
Substrate/Competitorn/a
Meas. Tech.ChEMBL_311661 (CHEMBL840833)
IC50 1300±n/a nM
Citation Romagnoli, RBaraldi, PGJung, MKIaconinoto, MACarrion, MDRemusat, VPreti, DTabrizi, MAFrancesca, FDe Clercq, EBalzarini, JHamel, E Synthesis and preliminary biological evaluation of new anti-tubulin agents containing different benzoheterocycles. Bioorg Med Chem Lett15:4048-52 (2005) 
 
Tubulin beta chain [1-43]
Name:Tubulin beta chain [1-43]
Type:PROTEIN
Mol. Mass.:4652.47
Organism:Leishmania donovani
Description:ChEMBL_311916
Residue:43
BDBM50170567
NameBDBM50170567
Synonyms:(3-Amino-6-methyl-benzo[b]thiophen-2-yl)-(3,4,5-trimethoxy-phenyl)-methanone CHEMBL190320
TypeSmall organic molecule
Emp. Form.C19H19NO4S
Mol. Mass.357.423
SMILESCOc1cc(cc(OC)c1OC)C(=O)c1sc2cc(C)ccc2c1N