Reaction Details
TargetTubulin beta chain [1-43]
LigandBDBM50170571
Substrate/Competitorn/a
Meas. Tech.ChEMBL_311661 (CHEMBL840833)
IC50 4200±n/a nM
Citation Romagnoli, RBaraldi, PGJung, MKIaconinoto, MACarrion, MDRemusat, VPreti, DTabrizi, MAFrancesca, FDe Clercq, EBalzarini, JHamel, E Synthesis and preliminary biological evaluation of new anti-tubulin agents containing different benzoheterocycles. Bioorg Med Chem Lett15:4048-52 (2005) 
 
Tubulin beta chain [1-43]
Name:Tubulin beta chain [1-43]
Type:PROTEIN
Mol. Mass.:4652.47
Organism:Leishmania donovani
Description:ChEMBL_311916
Residue:43
BDBM50170571
NameBDBM50170571
Synonyms:(3-Amino-benzo[b]thiophen-2-yl)-(3,4,5-trimethoxy-phenyl)-methanone CHEMBL371795
TypeSmall organic molecule
Emp. Form.C18H17NO4S
Mol. Mass.343.397
SMILESCOc1cc(cc(OC)c1OC)C(=O)c1sc2ccccc2c1N