Reaction Details
TargetAndrogen receptor
LigandBDBM50170573
Substrate/Competitorn/a
Meas. Tech.ChEMBL_320884 (CHEMBL884809)
Ki 1508±n/a nM
Citation Hosoda, STanatani, AWakabayashi, KNakano, YMiyachi, HNagasawa, KHashimoto, Y Ligands with dual vitamin D3-agonistic and androgen-antagonistic activities. Bioorg Med Chem Lett15:4327-31 (2005) 
 
Androgen receptor
Name:Androgen receptor
Type:Receptor
Mol. Mass.:99185.27
Organism:Homo sapiens (Human)
Description:CHO cells were stably transfected with human AR gene.
Residue:920
BDBM50170573
NameBDBM50170573
Synonyms:3-(4-{1-Ethyl-1-[4-(2-hydroxy-3,3-dimethyl-butoxy)-3-methyl-phenyl]-propyl}-2-methyl-phenylamino)-propane-1,2-diol | CHEMBL370567
TypeSmall organic molecule
Emp. Form.C28H43NO4
Mol. Mass.457.6453
SMILESCCC(CC)(c1ccc(NCC(O)CO)c(C)c1)c1ccc(OCC(O)C(C)(C)C)c(C)c1