Reaction Details
TargetAndrogen receptor
LigandBDBM50329704
Substrate/Competitorn/a
Meas. Tech.ChEMBL_322421 (CHEMBL873543)
IC50 19±n/a nM
Citation Hosoda, STanatani, AWakabayashi, KNakano, YMiyachi, HNagasawa, KHashimoto, Y Ligands with dual vitamin D3-agonistic and androgen-antagonistic activities. Bioorg Med Chem Lett15:4327-31 (2005) 
 
Androgen receptor
Name:Androgen receptor
Type:PROTEIN
Mol. Mass.:98196.62
Organism:Mus musculus
Description:ChEMBL_945930
Residue:899
BDBM50329704
NameBDBM50329704
Synonyms:(R)-3-(4-(3-(4-((R)-2-hydroxy-3,3-dimethylbutoxy)-3-methylphenyl)pentan-3-yl)-2-methylphenoxy)propane-1,2-diol | CHEMBL403670
TypeSmall organic molecule
Emp. Form.C28H42O5
Mol. Mass.458.6301
SMILESCCC(CC)(c1ccc(OC[C@H](O)CO)c(C)c1)c1ccc(OC[C@H](O)C(C)(C)C)c(C)c1