Reaction Details
TargetMelanin-concentrating hormone receptor 1
LigandBDBM50170611
Substrate/Competitorn/a
Meas. Tech.ChEMBL_302876 (CHEMBL828790)
Ki 11±n/a nM
Citation Palani, AShapiro, SMcBriar, MDClader, JWGreenlee, WJSpar, BKowalski, TJFarley, CCook, Jvan Heek, MWeig, BO'neill, KGraziano, MHawes, B Biaryl ureas as potent and orally efficacious melanin concentrating hormone receptor 1 antagonists for the treatment of obesity. J Med Chem48:4746-9 (2005) 
 
Melanin-concentrating hormone receptor 1
Name:Melanin-concentrating hormone receptor 1
Type:G Protein-Coupled Receptor (GPCR)
Mol. Mass.:45976.27
Organism:Homo sapiens (Human)
Description:Membranes from CHO-K1 cells stably expressing human MCH1R were used in assays.
Residue:422
BDBM50170611
NameBDBM50170611
Synonyms:1-(3'-Cyano-biphenyl-4-yl)-3-(3,4-dichloro-phenyl)-1-[2-((R)-3-hydroxy-pyrrolidin-1-yl)-ethyl]-urea | CHEMBL189029
TypeSmall organic molecule
Emp. Form.C26H24Cl2N4O2
Mol. Mass.495.4
SMILESO[C@@H]1CCN(CCN(C(=O)Nc2cc(Cl)cc(Cl)c2)c2ccc(cc2)-c2cccc(c2)C#N)C1