Reaction Details
TargetTyrosine-protein phosphatase non-receptor type 1
LigandBDBM50171117
Substrate/Competitorn/a
Meas. Tech.ChEMBL_320956 (CHEMBL885363)
Ki 13±n/a nM
Citation Holmes, CPLi, XPan, YXu, CBhandari, AMoody, CMMiguel, JAFerla, SWDe Francisco, MNFrederick, BTZhou, SMacher, NJang, LIrvine, JDGrove, JR Discovery and structure-activity relationships of novel sulfonamides as potent PTP1B inhibitors. Bioorg Med Chem Lett15:4336-41 (2005) 
 
Tyrosine-protein phosphatase non-receptor type 1
Name:Tyrosine-protein phosphatase non-receptor type 1
Type:Protein phosphatase
Mol. Mass.:49963.76
Organism:Homo sapiens (Human)
Description:Human recombinant GST-fusion PTP1B (1-435).
Residue:435
BDBM50171117
NameBDBM50171117
Synonyms:2-(4-(N-(3-bromo-4-(difluoro(phosphono)methyl)benzyl)-N-(4-(N,N-dimethylsulfamoyl)benzyl)sulfamoyl)phenoxy)acetic acid {4-[[3-Bromo-4-(difluoro-phosphono-methyl)-benzyl]-(4-dimethylsulfamoyl-benzyl)-sulfamoyl]-phenoxy}-acetic acid
TypeSmall organic molecule
Emp. Form.C25H26BrF2N2O10PS2
Mol. Mass.727.486
SMILESCN(C)S(=O)(=O)c1ccc(CN(Cc2ccc(c(Br)c2)C(F)(F)P(O)(O)=O)S(=O)(=O)c2ccc(OCC(O)=O)cc2)cc1