Reaction Details
TargetMetabotropic glutamate receptor 5
LigandBDBM50171313
Substrate/Competitorn/a
Meas. Tech.ChEMBL_303719 (CHEMBL829054)
Ki 2366±n/a nM
Citation Huang, YNarendran, RBischoff, FGuo, NZhu, ZBae, SALesage, ASLaruelle, M A positron emission tomography radioligand for the in vivo labeling of metabotropic glutamate 1 receptor: (3-ethyl-2-[11C]methyl-6-quinolinyl)(cis- 4-methoxycyclohexyl)methanone. J Med Chem48:5096-9 (2005) 
 
Metabotropic glutamate receptor 5
Name:Metabotropic glutamate receptor 5
Type:Enzyme
Mol. Mass.:131900.14
Organism:Rattus norvegicus (Rat)
Description:P31424
Residue:1203
BDBM50171313
NameBDBM50171313
Synonyms:(3-Ethyl-2-methyl-quinolin-6-yl)-(4-methoxy-cyclohexyl)-methanone | CHEMBL188906
TypeSmall organic molecule
Emp. Form.C20H25NO2
Mol. Mass.311.418
SMILESCCc1cc2cc(ccc2nc1C)C(=O)[C@@H]1CC[C@@H](CC1)OC