Reaction Details
TargetBeta-secretase 1
LigandBDBM50171340
Substrate/Competitorn/a
Meas. Tech.ChEMBL_303463 (CHEMBL838759)
Ki 8100±n/a nM
Citation Huang, DLüthi, UKolb, PEdler, KCecchini, MAudetat, SBarberis, ACaflisch, A Discovery of cell-permeable non-peptide inhibitors of beta-secretase by high-throughput docking and continuum electrostatics calculations. J Med Chem48:5108-11 (2005) 
 
Beta-secretase 1
Name:Beta-secretase 1
Type:Protein
Mol. Mass.:55755.10
Organism:Homo sapiens (Human)
Description:P56817
Residue:501
BDBM50171340
NameBDBM50171340
Synonyms:5-[3-(3,5-Bis-trifluoromethyl-phenyl)-ureido]-2-dimethylamino-N-(3-morpholin-4-yl-propyl)-benzamide | CHEMBL370043
TypeSmall organic molecule
Emp. Form.C25H29F6N5O3
Mol. Mass.561.5199
SMILESCN(C)c1ccc(NC(=O)Nc2cc(cc(c2)C(F)(F)F)C(F)(F)F)cc1C(=O)NCCCN1CCOCC1