Reaction Details
TargetMu-type opioid receptor
LigandBDBM50596292
Substrate/Competitorn/a
Meas. Tech.ChEMBL_2220240 (CHEMBL5133574)
Ki 0.158000±n/a nM
Citation Katoh, KYamamoto, NIshikawa, YIrukayama-Tomobe, YTanimura, RSaitoh, TNagumo, YKutsumura, NYanagisawa, MNagase, H Effect of removal of the 14-hydroxy group on the affinity of the 4,5-epoxymorphinan derivatives for orexin and opioid receptors. Bioorg Med Chem Lett59:0 (2022) 
 
Mu-type opioid receptor
Name:Mu-type opioid receptor
Type:G Protein-Coupled Receptor (GPCR)
Mol. Mass.:44789.51
Organism:Homo sapiens (Human)
Description:P35372
Residue:400
BDBM50596292
NameBDBM50596292
Synonyms:CHEMBL5185211
TypeSmall organic molecule
Emp. Form.C28H32N2O4
Mol. Mass.460.5647
SMILES[H][C@]12Oc3c4c(C[C@]5([H])C(CC[C@H]1N(C)C(=O)\C=C\c1ccoc1)[C@]24CCN5CC1CC1)ccc3O