Reaction Details
TargetKappa-type opioid receptor
LigandBDBM50325534
Substrate/Competitorn/a
Meas. Tech.ChEMBL_2220241 (CHEMBL5133575)
Ki 0.019000±n/a nM
Citation Katoh, KYamamoto, NIshikawa, YIrukayama-Tomobe, YTanimura, RSaitoh, TNagumo, YKutsumura, NYanagisawa, MNagase, H Effect of removal of the 14-hydroxy group on the affinity of the 4,5-epoxymorphinan derivatives for orexin and opioid receptors. Bioorg Med Chem Lett59:0 (2022) 
 
Kappa-type opioid receptor
Name:Kappa-type opioid receptor
Type:G Protein-Coupled Receptor (GPCR)
Mol. Mass.:42648.76
Organism:Homo sapiens (Human)
Description:P41145
Residue:380
BDBM50325534
NameBDBM50325534
Synonyms:CHEMBL267495 | nalfurafine
TypeSmall organic molecule
Emp. Form.C28H32N2O5
Mol. Mass.476.5641
SMILESCN([C@@H]1CC[C@@]2(O)[C@H]3Cc4ccc(O)c5O[C@@H]1[C@]2(CCN3CC1CC1)c45)C(=O)\C=C\c1ccoc1