Reaction Details
TargetKappa-type opioid receptor
LigandBDBM50596293
Substrate/Competitorn/a
Meas. Tech.ChEMBL_2220241 (CHEMBL5133575)
Ki 0.035600±n/a nM
Citation Katoh, KYamamoto, NIshikawa, YIrukayama-Tomobe, YTanimura, RSaitoh, TNagumo, YKutsumura, NYanagisawa, MNagase, H Effect of removal of the 14-hydroxy group on the affinity of the 4,5-epoxymorphinan derivatives for orexin and opioid receptors. Bioorg Med Chem Lett59:0 (2022) 
 
Kappa-type opioid receptor
Name:Kappa-type opioid receptor
Type:G Protein-Coupled Receptor (GPCR)
Mol. Mass.:42648.76
Organism:Homo sapiens (Human)
Description:P41145
Residue:380
BDBM50596293
NameBDBM50596293
Synonyms:CHEMBL5188658
TypeSmall organic molecule
Emp. Form.C28H30N2O4
Mol. Mass.458.5488
SMILES[H][C@@]12Oc3c4c(C[C@@]5([H])N(CC6CC6)CC[C@@]14C5=CC[C@H]2N(C)C(=O)\C=C\c1ccoc1)ccc3O