Reaction Details
TargetOrexin/Hypocretin receptor type 1
LigandBDBM50592810
Substrate/Competitorn/a
Meas. Tech.ChEMBL_2220281 (CHEMBL5133615)
Ki 2.2±n/a nM
Citation Hino, TSaitoh, TNagumo, YYamamoto, NKutsumura, NIrukayama-Tomobe, YIshikawa, YTanimura, RYanagisawa, MNagase, H Design and synthesis of novel orexin 2 receptor agonists based on naphthalene skeleton. Bioorg Med Chem Lett59:0 (2022) 
 
Orexin/Hypocretin receptor type 1
Name:Orexin/Hypocretin receptor type 1
Type:Protein
Mol. Mass.:47554.50
Organism:Homo sapiens (Human)
Description:O43613
Residue:425
BDBM50592810
NameBDBM50592810
Synonyms:CHEMBL5174113
TypeSmall organic molecule
Emp. Form.C36H35N3O7
Mol. Mass.621.679
SMILES[H][C@]12CO[C@]3([H])N1[C@@]([H])(O[C@@]3(C)c1cccc(NC(=O)c3ccc(OC)cc3)c1)[C@@](C)(O2)c1cccc(NC(=O)c2ccc(OC)cc2)c1