Reaction Details
TargetOrexin/Hypocretin receptor type 1
LigandBDBM50596397
Substrate/Competitorn/a
Meas. Tech.ChEMBL_2220461 (CHEMBL5133795)
Ki 4.8±n/a nM
Citation Katoh, KKutsumura, NYamamoto, NNagumo, YSaitoh, TIshikawa, YIrukayama-Tomobe, YTanimura, RYanagisawa, MNagase, H Essential structure of orexin 1 receptor antagonist YNT-707: Conversion of the 16-cyclopropylmethyl group to the 16-sulfonamide group in d-nor-nalfurafine derivatives. Bioorg Med Chem Lett59:0 (2022) 
 
Orexin/Hypocretin receptor type 1
Name:Orexin/Hypocretin receptor type 1
Type:Protein
Mol. Mass.:47554.50
Organism:Homo sapiens (Human)
Description:O43613
Residue:425
BDBM50596397
NameBDBM50596397
Synonyms:CHEMBL4116482
TypeSmall organic molecule
Emp. Form.C33H37N3O7S
Mol. Mass.619.728
SMILES[H][C@@]12Oc3c4c(C[C@@]5([H])N(CC[C@@]14[C@@]5(O)CC[C@H]2N(C)C(=O)\C=C\c1ccoc1)S(=O)(=O)c1ccccc1N(C)C)ccc3OC