Reaction Details
TargetOrexin/Hypocretin receptor type 1
LigandBDBM50454547
Substrate/Competitorn/a
Meas. Tech.ChEMBL_2220461 (CHEMBL5133795)
Ki 2.3±n/a nM
Citation Katoh, KKutsumura, NYamamoto, NNagumo, YSaitoh, TIshikawa, YIrukayama-Tomobe, YTanimura, RYanagisawa, MNagase, H Essential structure of orexin 1 receptor antagonist YNT-707: Conversion of the 16-cyclopropylmethyl group to the 16-sulfonamide group in d-nor-nalfurafine derivatives. Bioorg Med Chem Lett59:0 (2022) 
 
Orexin/Hypocretin receptor type 1
Name:Orexin/Hypocretin receptor type 1
Type:Protein
Mol. Mass.:47554.50
Organism:Homo sapiens (Human)
Description:O43613
Residue:425
BDBM50454547
NameBDBM50454547
Synonyms:CHEMBL4213974
TypeSmall organic molecule
Emp. Form.C31H30N2O6S
Mol. Mass.558.645
SMILES[H][C@@]12Oc3c4c(C[C@@]5([H])N(CC[C@@]14C5=CC[C@H]2N(C)C(=O)\C=C\c1ccoc1)S(=O)(=O)c1ccccc1)ccc3OC