Reaction Details
TargetGlucagon receptor
LigandBDBM50171818
Substrate/Competitorn/a
Meas. Tech.ChEMBL_321434 (CHEMBL880242)
IC50 3.2±n/a nM
Citation Shen, DMZhang, FBrady, EJCandelore, MRDallas-Yang, QDing, VDDragovic, JFeeney, WPJiang, GMcCann, PEMock, SQureshi, SASaperstein, RShen, XTamvakopoulos, CTong, XTota, LMWright, MJYang, XZheng, SChapman, KTZhang, BBTata, JRParmee, ER Discovery of novel, potent, and orally active spiro-urea human glucagon receptor antagonists. Bioorg Med Chem Lett15:4564-9 (2005) 
 
Glucagon receptor
Name:Glucagon receptor
Type:Enzyme
Mol. Mass.:54026.92
Organism:Homo sapiens (Human)
Description:P47871
Residue:477
BDBM50171818
NameBDBM50171818
Synonyms:4-[1-(4-tert-Butyl-cyclohexyl)-3-(4-trifluoromethoxy-phenyl)-ureidomethyl]-N-(1H-tetrazol-5-yl)-benzamide | CHEMBL196800
TypeSmall organic molecule
Emp. Form.C27H32F3N7O3
Mol. Mass.559.5833
SMILESCC(C)(C)C1CCC(CC1)N(Cc1ccc(cc1)C(=O)Nc1nnn[nH]1)C(=O)Nc1ccc(OC(F)(F)F)cc1