Reaction Details
TargetCannabinoid receptor 2
LigandBDBM50172146
Substrate/Competitorn/a
Meas. Tech.ChEMBL_320783 (CHEMBL884738)
Ki 0.4±n/a nM
Citation Shankar, BBLavey, BJZhou, GSpitler, JATong, LRizvi, RYang, DYWolin, RKozlowski, JAShih, NYWu, JHipkin, RWGonsiorek, WLunn, CA Triaryl bis-sulfones as cannabinoid-2 receptor ligands: SAR studies. Bioorg Med Chem Lett15:4417-20 (2005) 
 
Cannabinoid receptor 2
Name:Cannabinoid receptor 2
Type:G Protein-Coupled Receptor (GPCR)
Mol. Mass.:39690.94
Organism:Homo sapiens (Human)
Description:P34972
Residue:360
BDBM50172146
NameBDBM50172146
Synonyms:CHEMBL381669 | N-((S)-1-{4-[2-(2-Fluoro-benzenesulfonyl)-4-trifluoromethoxy-benzyl]-phenyl}-ethyl)-methanesulfonamide
TypeSmall organic molecule
Emp. Form.C23H21F4NO5S2
Mol. Mass.531.54
SMILESC[C@H](NS(C)(=O)=O)c1ccc(Cc2ccc(OC(F)(F)F)cc2S(=O)(=O)c2ccccc2F)cc1