Reaction Details
TargetCannabinoid receptor 2
LigandBDBM50172158
Substrate/Competitorn/a
Meas. Tech.ChEMBL_320783 (CHEMBL884738)
Ki 1±n/a nM
Citation Shankar, BBLavey, BJZhou, GSpitler, JATong, LRizvi, RYang, DYWolin, RKozlowski, JAShih, NYWu, JHipkin, RWGonsiorek, WLunn, CA Triaryl bis-sulfones as cannabinoid-2 receptor ligands: SAR studies. Bioorg Med Chem Lett15:4417-20 (2005) 
 
Cannabinoid receptor 2
Name:Cannabinoid receptor 2
Type:G Protein-Coupled Receptor (GPCR)
Mol. Mass.:39690.94
Organism:Homo sapiens (Human)
Description:P34972
Residue:360
BDBM50172158
NameBDBM50172158
Synonyms:(S)-N-(1-(4-(4-chloro-2-(2-fluorophenylsulfonyl)phenylsulfonyl)phenyl)ethyl)methanesulfonamide N-((S)-1-{4-[4-Chloro-2-(2-fluoro-benzenesulfonyl)-benzenesulfonyl]-phenyl}-ethyl)-methanesulfonamide | SCH-356036
TypeSmall organic molecule
Emp. Form.C21H19ClFNO6S3
Mol. Mass.532.025
SMILESC[C@H](NS(C)(=O)=O)c1ccc(cc1)S(=O)(=O)c1ccc(Cl)cc1S(=O)(=O)c1ccccc1F